Author List
type: ObjectProperty
comment: This property lists the authors of the publication

Editor List
type: ObjectProperty
comment: This property lists the editors of the publication

Electronic Copy
type: ObjectProperty
comment: This property locates electronic copy of the publication
domain: Published Work

First Name
type: DatatypeProperty
comment: This property gives the first name of the person
domain: Person

Middle Name
type: DatatypeProperty
comment: This property gives the middle name of the person
domain: Person

Full Name
type: DatatypeProperty
comment: This property full name of the person
domain: Person

Last Name
type: DatatypeProperty
comment: This property gives the Last Name of the person
domain: Person

Location
type: DatatypeProperty
comment: This property gives the location where workshop or conference was held
range: string
domain: Class
  union of: Refereed Conference Proceedings
  union of: Refereed Workshop Proceedings
  union of: Book Chapter

Number
type: DatatypeProperty
comment: This property gives the issue number of a periodical publication
domain: Articles in Periodical
range: nonNegativeInteger

Pages
type: DatatypeProperty
comment: This property indicates the page numbers of the journal, workshop or conference publication.
range: string
domain: Class
  union of: Articles in Periodical
  union of: Refereed Conference Proceedings
  union of: Refereed Workshop Proceedings
  union of: Book Chapter

Published By
type: DatatypeProperty
comment: This property gives the publisher for the publication
domain: Published Work
range: string

Publisher Location
type: DatatypeProperty
comment: This property gives the location of the publisher for the publication
domain: Published Work
range: string

Published In
type: DatatypeProperty
comment: This property gives the LNCS#### info or the name of the journal for articles, workshop and conference papers, as the case may be
domain: Articles in Periodical
domain: Refereed Conference Proceedings
domain: Refereed Workshop Proceedings
range: string

Published Year
type: DatatypeProperty
comment: This property gives the publishing year for the publication
domain: Published Work
range: string

Published Month
type: DatatypeProperty
comment: This property gives the publishing month for the publication
domain: Published Work
range: string

Date
type: DatatypeProperty
comment: This property is the date of the publication in YYYY-MM-DD format. Is used to sort publications. Use 01 for an unknown month or day.
domain: Published Work
range: date

Title
type: DatatypeProperty
comment: This property gives the title of the publication
domain: Class
  union of: Published Work
  union of: Journal
range: string

Venue
type: DatatypeProperty
comment: This property gives the venue of the conference or workshop
range: string
domain: Class
  union of: Refereed Conference Proceedings
  union of: Refereed Workshop Proceedings

Volume
type: DatatypeProperty
comment: This property gives the volume number of the article in refereeed journal
domain: Articles in Periodical
range: nonNegativeInteger

Book Title
type: DatatypeProperty
comment: This property gives the title of the book
domain: Book Chapter
range: string

Technical Report Number
type: DatatypeProperty
comment: This property gives the technical report number
domain: Technical Report
range: string

Descriptor
type: DatatypeProperty
comment: This property gives the paper descriptor(s) that apply to the paper. These Descriptors are instances of PaperDescriptor
domain: Published Work
range: Paper Descriptor

Articles in Periodical
type: Class
comment: This is class for articles in journals or magazines
subclass of: Published Work

Articles in refereed journal
type: Class
comment: This is class for articles in refereed journals
subclass of: Articles in Periodical

Journal
type: Class
comment: A periodical dedicated to a particular subject or professional activity.

Person
type: Class
comment: A human being.

Published Work
type: Class
comment: A written product that has been shared with the public.

Book Chapter
type: Class
comment: The class for book chapters
subclass of: Published Work

Proceedings
type: Class
comment: A collection of papers presented at an event or series such as a conference or workshop.
subclass of: Published Work

Refereed Conference Proceedings
type: Class
comment: The proceedings for a refereed conference.
subclass of: Proceedings

Refereed Workshop Proceedings
type: Class
comment: The proceedings for a refereed workshopd.
subclass of: Proceedings

Technical Report
type: Class
comment: The class for technical reports
subclass of: Published Work

Paper Descriptor
type: Class
comment: This is a class for paper descriptors (e.g. best paper). Instances of PaperDescriptor are meant to be objects of the Descriptor property, which indicates that that paper has attained said descriptor.

Best Paper
type: PaperDescriptor
comment: This indicates that a paper won a best paper award at the venue in which it was presented. bestPaper is an instance of Paper Descriptor and is meant to be the object of the Descriptor property.

Poster Paper
type: PaperDescriptor
comment: This indicates that a paper was a poster paper at the venue in which it was presented. posterPaper is an instance of Paper Descriptor and is meant to be the object of the Descriptor property.

Student Abstract
type: PaperDescriptor
comment: This indicates that a paper was a Student Abstract at the venue in which it was presented. studentAbstract is an instance of Paper Descriptor and is meant to be the object of the Descriptor property.